Target
Cell division cycle 7-related protein kinase
Ligand
BDBM50388878
Substrate
Meas. Tech.
ChEMBL_830839 (CHEMBL2065345)
Ki
0.501187±n/a nM
Citation
 Milletti, FHermann, JC Targeted kinase selectivity from kinase profiling data. ACS Med Chem Lett 3:383-386 (2012)  
Target
Name:
Cell division cycle 7-related protein kinase
Synonyms:
CDC7 CDC7L1 Cell division cycle 7-related protein kinase (CDC7) huCdc7
Type:
Protein
Mol. Mass.:
63908.16
Organism:
Homo sapiens (Human)
Description:
O00311
Residue:
574
  
Inhibitor
Name:
BDBM50388878
Synonyms:
CHEMBL1999931 | US9163007, 73
Type:
Small organic molecule
Emp. Form.:
C23H18N6O
Mol. Mass.:
394.4286
SMILES:
O=C(Nc1n[nH]c2ccc(cc12)-c1cn(Cc2ccccc2)nn1)c1ccccc1
: