Target
Cannabinoid receptor 1
Ligand
BDBM50388895
Substrate
Meas. Tech.
ChEMBL_830976 (CHEMBL2065576)
Ki
0.55±n/a nM
Citation
 Dow, RLCarpino, PAGautreau, DHadcock, JRIredale, PAKelly-Sullivan, DLizano, JSSchneider, SRScott, DOWard, KM Design of a Potent CB1 Receptor Antagonist Series: Potential Scaffold for Peripherally-Targeted Agents. ACS Med Chem Lett 3:397-401 (2012)  
Target
Name:
Cannabinoid receptor 1
Synonyms:
CANN6 CB-R CNR CNR1_HUMAN Cannabinoid receptor Cannabinoid receptor 1 (brain)
Type:
G Protein-Coupled Receptor (GPCR)
Mol. Mass.:
52868.96
Organism:
Homo sapiens (Human)
Description:
P21554
Residue:
472
  
Inhibitor
Name:
BDBM50388895
Synonyms:
CHEMBL2063248
Type:
Small organic molecule
Emp. Form.:
C23H18Cl2N4O3
Mol. Mass.:
469.32
SMILES:
Clc1ccc(cc1)-c1c2OCCCC(NC(=O)c3ccno3)c2nn1-c1ccccc1Cl
: