Target
Cannabinoid receptor 2
Ligand
BDBM50388902
Substrate
Meas. Tech.
ChEMBL_830977 (CHEMBL2065577)
Ki
953±n/a nM
Citation
 Dow, RLCarpino, PAGautreau, DHadcock, JRIredale, PAKelly-Sullivan, DLizano, JSSchneider, SRScott, DOWard, KM Design of a Potent CB1 Receptor Antagonist Series: Potential Scaffold for Peripherally-Targeted Agents. ACS Med Chem Lett 3:397-401 (2012)  
Target
Name:
Cannabinoid receptor 2
Synonyms:
CANNABINOID CB2 CB2 CB2B CNR2_HUMAN Cannabinoid CB2 receptor Cannabinoid receptor 2 (CB2R) | hCB2
Type:
G Protein-Coupled Receptor (GPCR)
Mol. Mass.:
39690.94
Organism:
Homo sapiens (Human)
Description:
P34972
Residue:
360
  
Inhibitor
Name:
BDBM50388902
Synonyms:
CHEMBL2063239
Type:
Small organic molecule
Emp. Form.:
C26H27Cl2N3O2
Mol. Mass.:
484.417
SMILES:
Clc1ccc(cc1)-c1c2OCCCC(NC(=O)C3CCCCC3)c2nn1-c1ccccc1Cl
: