Target
Metabotropic glutamate receptor 7
Ligand
BDBM50388941
Substrate
Meas. Tech.
ChEMBL_832801 (CHEMBL2066314)
EC50
>30000±n/a nM
Citation
 Melancon, BJHopkins, CRWood, MREmmitte, KANiswender, CMChristopoulos, AConn, PJLindsley, CW Allosteric modulation of seven transmembrane spanning receptors: theory, practice, and opportunities for central nervous system drug discovery. J Med Chem 55:1445-64 (2012)  
Target
Name:
Metabotropic glutamate receptor 7
Synonyms:
GPRC1G GRM7 protein MGLUR7 metabotropic glutamate 7
Type:
Enzyme Catalytic Domain
Mol. Mass.:
102262.98
Organism:
Homo sapiens (Human)
Description:
Q14831
Residue:
915
  
Inhibitor
Name:
BDBM50388941
Synonyms:
CHEMBL2063423
Type:
Small organic molecule
Emp. Form.:
C16H13N3O3
Mol. Mass.:
295.2927
SMILES:
O=NC1[C@@H]2C[C@@]2(Oc2ccccc12)C(=O)Nc1ccccn1
: