Target
Prostaglandin G/H synthase 1
Ligand
BDBM13065
Substrate
Meas. Tech.
ChEMBL_832832 (CHEMBL2066345)
IC50
9±n/a nM
Citation
 Liedtke, AJCrews, BCDaniel, CMBlobaum, ALKingsley, PJGhebreselasie, KMarnett, LJ Cyclooxygenase-1-selective inhibitors based on the (E)-2'-des-methyl-sulindac sulfide scaffold. J Med Chem 55:2287-300 (2012)  
Target
Name:
Prostaglandin G/H synthase 1
Synonyms:
COX-1 Cyclooxygenase Cyclooxygenase-1 (COX-1) PTGS1 | Prostaglandin G/H synthase (cyclooxygenase)
Type:
Enzyme
Mol. Mass.:
68692.62
Organism:
Homo sapiens (Human)
Description:
P23219
Residue:
599
  
Inhibitor
Name:
BDBM13065
Synonyms:
5-(4-chlorophenyl)-1-(4-methoxyphenyl)-3-(trifluoromethyl)-1H-pyrazole SC-560
Type:
Small organic molecule
Emp. Form.:
C17H12ClF3N2O
Mol. Mass.:
352.738
SMILES:
COc1ccc(cc1)-n1nc(cc1-c1ccc(Cl)cc1)C(F)(F)F
: