Target
Bcl-2-like protein 1
Ligand
BDBM50388993
Substrate
Meas. Tech.
ChEMBL_832858 (CHEMBL2066620)
IC50
3.6±n/a nM
Citation
 Zhou, HChen, JMeagher, JLYang, CYAguilar, ALiu, LBai, LCong, XCai, QFang, XStuckey, JAWang, S Design of Bcl-2 and Bcl-xL inhibitors with subnanomolar binding affinities based upon a new scaffold. J Med Chem 55:4664-82 (2012)  
Target
Name:
Bcl-2-like protein 1
Synonyms:
Anti-apoptotic Bcl-2 protein Apoptosis regulator Bcl-X BCL2-like 1 isoform 1 BCL2L1 Bcl-2-like protein 1 (Bcl-XL) Bcl-xL/Bcl-2-binding component 3 Bcl2-antagonist of cell death (BAD)
Type:
Mitochondrion membrane; Single-pass membrane protein
Mol. Mass.:
26039.60
Organism:
Homo sapiens (Human)
Description:
Residue:
233
  
Inhibitor
Name:
BDBM50388993
Synonyms:
CHEMBL2063896
Type:
Small organic molecule
Emp. Form.:
C46H48ClN7O6S2
Mol. Mass.:
894.5
SMILES:
CN(C)CC[C@H](CSc1ccccc1)Nc1ccc(cc1[N+]([O-])=O)S(=O)(=O)Nc1ccc(cc1)N1CCN(CC1)c1cccc(c1)-c1c(cn(C)c1C(O)=O)-c1ccc(Cl)cc1
: