Target
ALK tyrosine kinase receptor
Ligand
BDBM50389156
Substrate
Meas. Tech.
ChEMBL_833217 (CHEMBL2067581)
IC50
3.1±n/a nM
Citation
 Gingrich, DELisko, JGCurry, MACheng, MQuail, MLu, LWan, WAlbom, MSAngeles, TSAimone, LDHaltiwanger, RCWells-Knecht, KOtt, GRGhose, AKAtor, MARuggeri, BDorsey, BD Discovery of an orally efficacious inhibitor of anaplastic lymphoma kinase. J Med Chem 55:4580-93 (2012)  
Target
Name:
ALK tyrosine kinase receptor
Synonyms:
ALK ALK_HUMAN CD_antigen: CD246
Type:
Protein
Mol. Mass.:
176453.10
Organism:
Homo sapiens (Human)
Description:
Q9UM73
Residue:
1620
  
Inhibitor
Name:
BDBM50389156
Synonyms:
CHEMBL2064722
Type:
Small organic molecule
Emp. Form.:
C29H38ClN7O2
Mol. Mass.:
552.111
SMILES:
COc1c(Nc2ncc(Cl)c(N[C@@H]3[C@@H]4C[C@@H](C=C4)[C@@H]3C(N)=O)n2)ccc2CCC(CCc12)N1CCN(C)CC1
: