Target
Excitatory amino acid transporter 2
Ligand
BDBM50389173
Substrate
Meas. Tech.
ChEMBL_833021 (CHEMBL2067160)
IC50
>300000±n/a nM
Citation
 Huynh, THShim, IBohr, HAbrahamsen, BNielsen, BJensen, AABunch, L Structure-activity relationship study of selective excitatory amino acid transporter subtype 1 (EAAT1) inhibitor 2-amino-4-(4-methoxyphenyl)-7-(naphthalen-1-yl)-5-oxo-5,6,7,8-tetrahydro-4H-chromene-3-carbonitrile (UCPH-101) and absolute configurational assignment using infrared and vibrational circ J Med Chem 55:5403-12 (2012)  
Target
Name:
Excitatory amino acid transporter 2
Synonyms:
EAA2_HUMAN GLT1 SLC1A2 Solute carrier family 1 member 2
Type:
Enzyme Catalytic Domain
Mol. Mass.:
62103.57
Organism:
Homo sapiens (Human)
Description:
Excitatory Amino Acid EAAT2 0 0::P43004
Residue:
574
  
Inhibitor
Name:
BDBM50389173
Synonyms:
CHEMBL2062783
Type:
Small organic molecule
Emp. Form.:
C23H21N3O2
Mol. Mass.:
371.4317
SMILES:
C[C@H](N1CC(=O)C2=C(C1)OC(=N)C(C#N)[C@H]2c1ccccc1)c1ccccc1
: