Target
Tyrosine-protein kinase JAK2
Ligand
BDBM99615
Substrate
Meas. Tech.
ChEMBL_833247 (CHEMBL2067611)
IC50
3.1±n/a nM
Citation
 Dugan, BJGingrich, DEMesaros, EFMilkiewicz, KLCurry, MAZulli, ALDobrzanski, PSerdikoff, CJan, MAngeles, TSAlbom, MSMason, JLAimone, LDMeyer, SLHuang, ZWells-Knecht, KJAtor, MARuggeri, BADorsey, BD A selective, orally bioavailable 1,2,4-triazolo[1,5-a]pyridine-based inhibitor of Janus kinase 2 for use in anticancer therapy: discovery of CEP-33779. J Med Chem 55:5243-54 (2012)  
Target
Name:
Tyrosine-protein kinase JAK2
Synonyms:
JAK-2 JAK2_HUMAN Janus kinase 2 (JAK2) | Janus kinase 2 (a protein tyrosine kinase)
Type:
Protein
Mol. Mass.:
130684.68
Organism:
Homo sapiens (Human)
Description:
O60674
Residue:
1132
  
Inhibitor
Name:
BDBM99615
Synonyms:
CHEMBL2062806 | US8501936, 116
Type:
Small organic molecule
Emp. Form.:
C25H28N6O2S
Mol. Mass.:
476.594
SMILES:
CN1CCN(Cc2cccc(Nc3nc4c(cccn4n3)-c3ccc(cc3)S(C)(=O)=O)c2)CC1
: