Target
Tyrosine-protein kinase JAK2
Ligand
BDBM99567
Substrate
Meas. Tech.
ChEMBL_833040 (CHEMBL2067179)
IC50
476±n/a nM
Citation
 Dugan, BJGingrich, DEMesaros, EFMilkiewicz, KLCurry, MAZulli, ALDobrzanski, PSerdikoff, CJan, MAngeles, TSAlbom, MSMason, JLAimone, LDMeyer, SLHuang, ZWells-Knecht, KJAtor, MARuggeri, BADorsey, BD A selective, orally bioavailable 1,2,4-triazolo[1,5-a]pyridine-based inhibitor of Janus kinase 2 for use in anticancer therapy: discovery of CEP-33779. J Med Chem 55:5243-54 (2012)  
Target
Name:
Tyrosine-protein kinase JAK2
Synonyms:
JAK-2 JAK2_HUMAN Janus kinase 2 (JAK2) | Janus kinase 2 (a protein tyrosine kinase)
Type:
Protein
Mol. Mass.:
130684.68
Organism:
Homo sapiens (Human)
Description:
O60674
Residue:
1132
  
Inhibitor
Name:
BDBM99567
Synonyms:
CHEMBL2062811 | US8501936, 65
Type:
Small organic molecule
Emp. Form.:
C24H23F3N6
Mol. Mass.:
452.4748
SMILES:
CN1CCN(CC1)c1cccc(Nc2nc3c(cccn3n2)-c2ccc(cc2)C(F)(F)F)c1
: