Target
Alpha-synuclein
Ligand
BDBM50389293
Substrate
Meas. Tech.
ChEMBL_831727 (CHEMBL2065090)
Ki
346±n/a nM
Citation
 Yu, LCui, JPadakanti, PKEngel, LBagchi, DPKotzbauer, PTTu, Z Synthesis and in vitro evaluation ofa-synuclein ligands. Bioorg Med Chem 20:4625-34 (2012)  
Target
Name:
Alpha-synuclein
Synonyms:
NACP SNCA | SYUA_HUMAN
Type:
Protein
Mol. Mass.:
14451.42
Organism:
Homo sapiens (Human)
Description:
P37840
Residue:
140
  
Inhibitor
Name:
BDBM50389293
Synonyms:
CHEMBL2063786
Type:
Small organic molecule
Emp. Form.:
C14H10N2OS
Mol. Mass.:
254.307
SMILES:
COc1ccc2Nc3ccc(cc3Sc2c1)C#N
: