Target
Alpha-synuclein
Ligand
BDBM50389296
Substrate
Meas. Tech.
ChEMBL_831727 (CHEMBL2065090)
Ki
106±n/a nM
Citation
 Yu, LCui, JPadakanti, PKEngel, LBagchi, DPKotzbauer, PTTu, Z Synthesis and in vitro evaluation ofa-synuclein ligands. Bioorg Med Chem 20:4625-34 (2012)  
Target
Name:
Alpha-synuclein
Synonyms:
NACP SNCA | SYUA_HUMAN
Type:
Protein
Mol. Mass.:
14451.42
Organism:
Homo sapiens (Human)
Description:
P37840
Residue:
140
  
Inhibitor
Name:
BDBM50389296
Synonyms:
CHEMBL2063789
Type:
Small organic molecule
Emp. Form.:
C12H7IN2O2S
Mol. Mass.:
370.166
SMILES:
[O-][N+](=O)c1ccc2Nc3ccc(I)cc3Sc2c1
: