Target
Phosphatidylinositol 4,5-bisphosphate 3-kinase catalytic subunit gamma isoform
Ligand
BDBM50389391
Substrate
Meas. Tech.
ChEMBL_831960 (CHEMBL2065218)
IC50
15.85±n/a nM
Citation
 Bell, KSunose, MEllard, KCansfield, ATaylor, JMiller, WRamsden, NBergamini, GNeubauer, G SAR studies around a series of triazolopyridines as potent and selective PI3K¿ inhibitors. Bioorg Med Chem Lett 22:5257-63 (2012)  
Target
Name:
Phosphatidylinositol 4,5-bisphosphate 3-kinase catalytic subunit gamma isoform
Synonyms:
PI3-kinase p110 subunit gamma PI3Kgamma PK3CG_HUMAN Phosphatidylinositol 4,5-bisphosphate 3-kinase (PI3K) Phosphatidylinositol 4,5-bisphosphate 3-kinase catalytic subunit gamma (PI3Kgamma) Phosphatidylinositol 4,5-bisphosphate 3-kinase catalytic subunit gamma isoform (PI3K) Phosphatidylinositol-4,5-bisphosphate 3-kinase catalytic subunit gamma isoform Phosphoinositide 3-kinases gamma (PI3K gamma) p120-PI3K
Type:
Enzyme Subunit
Mol. Mass.:
126470.30
Organism:
Homo sapiens (Human)
Description:
P48736
Residue:
1102
  
Inhibitor
Name:
BDBM50389391
Synonyms:
CHEMBL2064512
Type:
Small organic molecule
Emp. Form.:
C15H16N6O2S
Mol. Mass.:
344.392
SMILES:
Nc1nc2ccc(cn2n1)-c1cncc(c1)S(=O)(=O)NCC1CC1
: