Target
Phosphatidylinositol 4,5-bisphosphate 3-kinase catalytic subunit delta isoform
Ligand
BDBM50389428
Substrate
Meas. Tech.
ChEMBL_831961 (CHEMBL2065219)
IC50
1584.89±n/a nM
Citation
 Bell, KSunose, MEllard, KCansfield, ATaylor, JMiller, WRamsden, NBergamini, GNeubauer, G SAR studies around a series of triazolopyridines as potent and selective PI3K¿ inhibitors. Bioorg Med Chem Lett 22:5257-63 (2012)  
Target
Name:
Phosphatidylinositol 4,5-bisphosphate 3-kinase catalytic subunit delta isoform
Synonyms:
PI3-kinase p110 subunit delta PI3-kinase subunit p110-delta PIK3CD Phosphatidylinositol 4,5-biphosphate 3-kinase catalytic subunit delta (PIK3CD) Phosphatidylinositol 4,5-bisphosphate 3-kinase 110 kDa catalytic subunit delta (PI3K delta) Phosphatidylinositol 4,5-bisphosphate 3-kinase catalytic subunit delta (PI3Kdelta) Phosphatidylinositol 4,5-bisphosphate 3-kinase catalytic subunit delta isoform (PI3K delta) Phosphatidylinositol 4,5-bisphosphate 3-kinase catalytic subunit delta isoform (PI3K-delta) Phosphatidylinositol 4,5-bisphosphate 3-kinase catalytic subunit delta isoform (PI3Kdelta)
Type:
Enzyme Subunit
Mol. Mass.:
119489.41
Organism:
Homo sapiens (Human)
Description:
O00329
Residue:
1044
  
Inhibitor
Name:
BDBM50389428
Synonyms:
CHEMBL2064511
Type:
Small organic molecule
Emp. Form.:
C14H16N6O2S
Mol. Mass.:
332.381
SMILES:
CC(C)NS(=O)(=O)c1cncc(c1)-c1ccc2nc(N)nn2c1
: