Target
Vesicular acetylcholine transporter
Ligand
BDBM50389432
Substrate
Meas. Tech.
ChEMBL_832031 (CHEMBL2065327)
Ki
20.5±n/a nM
Citation
 Kozaka, TUno, IKitamura, YMiwa, DOgawa, KShiba, K Syntheses and in vitro evaluation of decalinvesamicol analogues as potential imaging probes for vesicular acetylcholine transporter (VAChT). Bioorg Med Chem 20:4936-41 (2012)  
Target
Name:
Vesicular acetylcholine transporter
Synonyms:
Slc18a3 VACHT_RAT Vat | rVAT
Type:
PROTEIN
Mol. Mass.:
56533.41
Organism:
Rattus norvegicus
Description:
ChEMBL_1503353
Residue:
530
  
Inhibitor
Name:
BDBM50389432
Synonyms:
CHEMBL2064618
Type:
Small organic molecule
Emp. Form.:
C21H30INO
Mol. Mass.:
439.3735
SMILES:
OC1C[C@@H]2CCCC[C@H]2CC1N1CCC(CC1)c1ccccc1I
: