Target
Orphan methyltransferase M.SssI
Ligand
BDBM50389491
Substrate
Meas. Tech.
ChEMBL_832312 (CHEMBL2066850)
Ki
33000±n/a nM
Citation
 Plitta, BAdamska, EGiel-Pietraszuk, MFedoruk-Wyszomirska, ANaskret-Barciszewska, MMarkiewicz, WTBarciszewski, J New cytosine derivatives as inhibitors of DNA methylation. Eur J Med Chem 55:243-54 (2012)  
Target
Name:
Orphan methyltransferase M.SssI
Synonyms:
CpG DNA methylase MTSI_SPISQ sssIM
Type:
Protein
Mol. Mass.:
44323.75
Organism:
Spiroplasma monobiae strain MQ-1
Description:
P15840
Residue:
386
  
Inhibitor
Name:
BDBM50389491
Synonyms:
CHEMBL2063057
Type:
Small organic molecule
Emp. Form.:
C12H13N3O4S
Mol. Mass.:
295.314
SMILES:
OS(=O)(=O)Cc1cnc(=O)[nH]c1NCc1ccccc1
: