Target
Orphan methyltransferase M.SssI
Ligand
BDBM50070942
Substrate
Meas. Tech.
ChEMBL_832312 (CHEMBL2066850)
Ki
28±n/a nM
Citation
 Plitta, BAdamska, EGiel-Pietraszuk, MFedoruk-Wyszomirska, ANaskret-Barciszewska, MMarkiewicz, WTBarciszewski, J New cytosine derivatives as inhibitors of DNA methylation. Eur J Med Chem 55:243-54 (2012)  
Target
Name:
Orphan methyltransferase M.SssI
Synonyms:
CpG DNA methylase MTSI_SPISQ sssIM
Type:
Protein
Mol. Mass.:
44323.75
Organism:
Spiroplasma monobiae strain MQ-1
Description:
P15840
Residue:
386
  
Inhibitor
Name:
BDBM50070942
Synonyms:
(-)-Epigallocatechin gallate (-)-epigallocatechin 3-gallate CHEMBL297453 Epigallocatechin 3-gallate cid_65064
Type:
Small organic molecule
Emp. Form.:
C22H18O11
Mol. Mass.:
458.3717
SMILES:
Oc1cc(O)c2C[C@@H](OC(=O)c3cc(O)c(O)c(O)c3)[C@H](Oc2c1)c1cc(O)c(O)c(O)c1
: