Target
Proto-oncogene tyrosine-protein kinase Src
Ligand
BDBM50389690
Substrate
Meas. Tech.
ChEMBL_834203 (CHEMBL2072943)
IC50
>10000±n/a nM
Citation
 Johnson, SMMurphy, RCGeiger, JADeRocher, AEZhang, ZOjo, KKLarson, ETPerera, BGDale, EJHe, PReid, MCFox, AMMueller, NRMerritt, EAFan, EParsons, MVan Voorhis, WCMaly, DJ Development of Toxoplasma gondii calcium-dependent protein kinase 1 (TgCDPK1) inhibitors with potent anti-toxoplasma activity. J Med Chem 55:2416-26 (2012)  
Target
Name:
Proto-oncogene tyrosine-protein kinase Src
Synonyms:
Calmodulin/Proto-oncogene tyrosine-protein kinase Src Proto-oncogene c-Src SRC SRC_HUMAN V-src sarcoma (Schmidt-Ruppin A-2) viral oncogene homolog (avian) p60-Src | pp60c-src
Type:
Protein
Mol. Mass.:
59838.60
Organism:
Homo sapiens (Human)
Description:
P12931
Residue:
536
  
Inhibitor
Name:
BDBM50389690
Synonyms:
CHEMBL2070056 US11247972, Compound 33 | US9765037, Compound 33
Type:
Small organic molecule
Emp. Form.:
C24H28N6O
Mol. Mass.:
416.5187
SMILES:
CCCOc1ccc2cc(ccc2c1)-c1nn(CC2CCNCC2)c2ncnc(N)c12
: