Target
Ephrin type-A receptor 3
Ligand
BDBM50345740
Substrate
Meas. Tech.
ChEMBL_834207 (CHEMBL2072947)
IC50
3700±n/a nM
Citation
 Johnson, SMMurphy, RCGeiger, JADeRocher, AEZhang, ZOjo, KKLarson, ETPerera, BGDale, EJHe, PReid, MCFox, AMMueller, NRMerritt, EAFan, EParsons, MVan Voorhis, WCMaly, DJ Development of Toxoplasma gondii calcium-dependent protein kinase 1 (TgCDPK1) inhibitors with potent anti-toxoplasma activity. J Med Chem 55:2416-26 (2012)  
Target
Name:
Ephrin type-A receptor 3
Synonyms:
EPHA3 ETK Ephrin receptor Ephrin type-A receptor 3 (EPHA3) TYRO4
Type:
Protein
Mol. Mass.:
110131.95
Organism:
Homo sapiens (Human)
Description:
P29320
Residue:
983
  
Inhibitor
Name:
BDBM50345740
Synonyms:
3-(6-ethoxynaphthalen-2-yl)-1-isopropyl-1H-pyrazolo[3,4-d]pyrimidin-4-amine CHEMBL2070048 US11247972, Compound 7r | US9765037, Compound 7r
Type:
Small organic molecule
Emp. Form.:
C20H21N5O
Mol. Mass.:
347.4136
SMILES:
CCOc1ccc2cc(ccc2c1)-c1nn(C(C)C)c2ncnc(N)c12
: