Target
Ephrin type-A receptor 3
Ligand
BDBM50389704
Substrate
Meas. Tech.
ChEMBL_834207 (CHEMBL2072947)
IC50
>10000±n/a nM
Citation
 Johnson, SMMurphy, RCGeiger, JADeRocher, AEZhang, ZOjo, KKLarson, ETPerera, BGDale, EJHe, PReid, MCFox, AMMueller, NRMerritt, EAFan, EParsons, MVan Voorhis, WCMaly, DJ Development of Toxoplasma gondii calcium-dependent protein kinase 1 (TgCDPK1) inhibitors with potent anti-toxoplasma activity. J Med Chem 55:2416-26 (2012)  
Target
Name:
Ephrin type-A receptor 3
Synonyms:
EPHA3 ETK Ephrin receptor Ephrin type-A receptor 3 (EPHA3) TYRO4
Type:
Protein
Mol. Mass.:
110131.95
Organism:
Homo sapiens (Human)
Description:
P29320
Residue:
983
  
Inhibitor
Name:
BDBM50389704
Synonyms:
CHEMBL2070081 US9518026, Example 9 US9956214, Compound 9
Type:
Small organic molecule
Emp. Form.:
C24H28N6O
Mol. Mass.:
416.5187
SMILES:
CCOc1ccc2cc(ccc2c1)-c1nn(CC2CCN(C)CC2)c2ncnc(N)c12
: