Target
cAMP and cAMP-inhibited cGMP 3',5'-cyclic phosphodiesterase 10A
Ligand
BDBM50389801
Substrate
Meas. Tech.
ChEMBL_834602 (CHEMBL2072402)
IC50
0.8±n/a nM
Citation
 Hu, EMa, JBiorn, CLester-Zeiner, DCho, RRumfelt, SKunz, RKNixey, TMichelsen, KMiller, SShi, JWong, JHill Della Puppa, GAble, JTalreja, SHwang, DRHitchcock, SAPorter, AImmke, DAllen, JRTreanor, JChen, H Rapid identification of a novel small molecule phosphodiesterase 10A (PDE10A) tracer. J Med Chem 55:4776-87 (2012)  
Target
Name:
cAMP and cAMP-inhibited cGMP 3',5'-cyclic phosphodiesterase 10A
Synonyms:
3',5'-cyclic phosphodiesterase PDE10_HUMAN Phosphodiesterase 10A
Type:
Protein
Mol. Mass.:
88412.52
Organism:
Homo sapiens (Human)
Description:
Q9Y233
Residue:
779
  
Inhibitor
Name:
BDBM50389801
Synonyms:
CHEMBL2070528
Type:
Small organic molecule
Emp. Form.:
C24H25N5O2
Mol. Mass.:
415.4876
SMILES:
COc1cc2nncc(-c3cnc(N[C@@H](C)Cc4ccccn4)c(C)c3)c2cc1OC
: