Target
Adenosine receptor A2a
Ligand
BDBM50389902
Substrate
Meas. Tech.
ChEMBL_834862 (CHEMBL2073179)
Ki
>5000±n/a nM
Citation
 Baraldi, PGSaponaro, GRomagnoli, RAghazadeh Tabrizi, MBaraldi, SMoorman, ARCosconati, SDi Maro, SMarinelli, LGessi, SMerighi, SVarani, KBorea, PAPreti, D Water-soluble pyrazolo[4,3-e][1,2,4]triazolo[1,5-c]pyrimidines as human A3 adenosine receptor antagonists. J Med Chem 55:5380-90 (2012)  
Target
Name:
Adenosine receptor A2a
Synonyms:
A2A adenosine receptor (hA2A) ADENOSINE A2 ADORA2 Adenosine A2A receptor (A2AAR)
Type:
G Protein-Coupled Receptor (GPCR)
Mol. Mass.:
44716.46
Organism:
Homo sapiens (Human)
Description:
P29274
Residue:
412
  
Inhibitor
Name:
BDBM50389902
Synonyms:
CHEMBL2070885
Type:
Small organic molecule
Emp. Form.:
C24H31N9O2
Mol. Mass.:
477.562
SMILES:
Cn1cc2c(n1)nc(NC(=O)NC1CCN(CC3CCCCC3)CC1)n1nc(nc21)-c1ccco1
: