Target
Aurora kinase B
Ligand
BDBM50389997
Substrate
Meas. Tech.
ChEMBL_835007 (CHEMBL2073499)
IC50
61±n/a nM
Citation
 Curtin, MLHeyman, HRFrey, RRMarcotte, PAGlaser, KBJankowski, JRMagoc, TJAlbert, DHOlson, AMReuter, DRBouska, JJMontgomery, DAPalma, JPDonawho, CKStewart, KDTse, CMichaelides, MR Pyrazole diaminopyrimidines as dual inhibitors of KDR and Aurora B kinases. Bioorg Med Chem Lett 22:4750-5 (2012)  
Target
Name:
Aurora kinase B
Synonyms:
AIK2 AIM1 ARK2 AURKB_HUMAN Aurora B-INCENP Aurora kinase B (AURKB) STK-1 STK12 Serine/threonine-protein kinase aurora B
Type:
Protein
Mol. Mass.:
39327.72
Organism:
Homo sapiens (Human)
Description:
Q96GD4
Residue:
344
  
Inhibitor
Name:
BDBM50389997
Synonyms:
CHEMBL2071204
Type:
Small organic molecule
Emp. Form.:
C16H19F3N6
Mol. Mass.:
352.3575
SMILES:
Cn1cc(Nc2ncc(c(N[C@H]3C[C@@H]4CC[C@H]3C4)n2)C(F)(F)F)cn1
: