Target
Nitric oxide synthase, inducible
Ligand
BDBM50390001
Substrate
Meas. Tech.
ChEMBL_835213 (CHEMBL2072472)
IC50
101200±n/a nM
Citation
 Shaaban, KAAhmed, TALeggas, MRohr, J Saquayamycins G-K, cytotoxic angucyclines from Streptomyces sp. Including two analogues bearing the aminosugar rednose. J Nat Prod 75:1383-92 (2012)  
Target
Name:
Nitric oxide synthase, inducible
Synonyms:
HEP-NOS Inducible NO synthase NOS type II NOS2A Nitric oxide synthase, inducible (iNOS) | iNOS
Type:
Homodimer
Mol. Mass.:
131141.95
Organism:
Homo sapiens (Human)
Description:
P35228
Residue:
1153
  
Inhibitor
Name:
BDBM50390001
Synonyms:
CHEMBL2071401
Type:
Small organic molecule
Emp. Form.:
C31H32O12
Mol. Mass.:
596.5786
SMILES:
C[C@H]1O[C@H](C[C@@H](O)[C@@H]1O[C@@H]1O[C@@H](C)C(=O)C=C1)c1ccc2C(=O)C3=C(C=C[C@]4(O)C[C@@](C)(O)CC(=O)[C@]34O)C(=O)c2c1O
: