Target
Dipeptidyl peptidase 4
Ligand
BDBM50390171
Substrate
Meas. Tech.
ChEMBL_834621 (CHEMBL2072421)
IC50
65.4±n/a nM
Citation
 Kim, HJKwak, WYMin, JPSung, SYKim, HDKim, MKKim, HSPark, KJSon, MHKim, SHLee, BJ Dipeptidyl peptidase-4 inhibitor withß-amino amide scaffold: synthesis, SAR and biological evaluation. Bioorg Med Chem Lett 22:5545-9 (2012)  
Target
Name:
Dipeptidyl peptidase 4
Synonyms:
ADABP Adenosine deaminase complexing protein 2 CD_antigen=CD26 DPP4 DPPIV Dipeptidyl peptidase 4 (DPP IV) Dipeptidyl peptidase 4 (DPP4) Dipeptidyl peptidase 4 membrane form Dipeptidyl peptidase IV Dipeptidyl peptidase IV (DDP-IV) Dipeptidyl peptidase IV membrane form Dipeptidyl peptidase-IV (DPP-4) T-cell activation antigen CD26 | TP103
Type:
Enzyme
Mol. Mass.:
88271.01
Organism:
Homo sapiens (Human)
Description:
P27487
Residue:
766
  
Inhibitor
Name:
BDBM50390171
Synonyms:
CHEMBL2069849
Type:
Small organic molecule
Emp. Form.:
C24H24F3N3O4
Mol. Mass.:
475.4603
SMILES:
COc1cccc2cc(oc12)C(=O)N1CCN(CC1)C(=O)C[C@H](N)Cc1cc(F)c(F)cc1F
: