Target
Sigma non-opioid intracellular receptor 1
Ligand
BDBM50390203
Substrate
Meas. Tech.
ChEMBL_834660 (CHEMBL2072546)
Ki
0.54±n/a nM
Citation
 Moussa, IABanister, SDManoli, MDoddareddy, MRCui, JMach, RHKassiou, M Exploration of ring size in a series of cyclic vicinal diamines withs1 receptor affinity. Bioorg Med Chem Lett 22:5493-7 (2012)  
Target
Name:
Sigma non-opioid intracellular receptor 1
Synonyms:
OPRS1 SIGMAR1 Sigma non-opioid intracellular receptor 1 Sigma1-receptor Sterol isomerase-like protein
Type:
Protein
Mol. Mass.:
25307.17
Organism:
Cavia porcellus (Guinea pig)
Description:
Q60492
Residue:
223
  
Inhibitor
Name:
BDBM50390203
Synonyms:
CHEMBL2069861
Type:
Small organic molecule
Emp. Form.:
C22H26N2O2
Mol. Mass.:
350.454
SMILES:
COc1ccc(CN2CCCN(Cc3cc4ccccc4o3)CC2)cc1
: