Target
Tyrosine-protein kinase receptor UFO
Ligand
BDBM50390444
Substrate
Meas. Tech.
ChEMBL_835241 (CHEMBL2072598)
IC50
>10000±n/a nM
Citation
 Zhang, DAi, JLiang, ZLi, CPeng, XJi, YJiang, HGeng, MLuo, CLiu, H Discovery of novel 2-aminopyridine-3-carboxamides as c-Met kinase inhibitors. Bioorg Med Chem 20:5169-80 (2012)  
Target
Name:
Tyrosine-protein kinase receptor UFO
Synonyms:
AXL TEL/AXL UFO | UFO_HUMAN
Type:
Enzyme
Mol. Mass.:
98316.97
Organism:
Homo sapiens (Human)
Description:
P30530
Residue:
894
  
Inhibitor
Name:
BDBM50390444
Synonyms:
CHEMBL2071457
Type:
Small organic molecule
Emp. Form.:
C22H22Cl2FN5O2
Mol. Mass.:
478.347
SMILES:
C[C@H](NC(=O)c1cc(cnc1N)-c1cnn(c1)C1CCOCC1)c1c(Cl)ccc(F)c1Cl
: