Target
Tyrosine-protein kinase ABL1
Ligand
BDBM50390444
Substrate
Meas. Tech.
ChEMBL_835247 (CHEMBL2072604)
IC50
4990±n/a nM
Citation
 Zhang, DAi, JLiang, ZLi, CPeng, XJi, YJiang, HGeng, MLuo, CLiu, H Discovery of novel 2-aminopyridine-3-carboxamides as c-Met kinase inhibitors. Bioorg Med Chem 20:5169-80 (2012)  
Target
Name:
Tyrosine-protein kinase ABL1
Synonyms:
ABL ABL1_HUMAN JTK7 Proto-oncogene tyrosine-protein kinase ABL1 Tyrosine-protein kinase ABL V-abl Abelson murine leukemia viral oncogene homolog 1 p150 | tyrosine-protein kinase ABL1 isoform a
Type:
Enzyme
Mol. Mass.:
122897.30
Organism:
Homo sapiens (Human)
Description:
P00519
Residue:
1130
  
Inhibitor
Name:
BDBM50390444
Synonyms:
CHEMBL2071457
Type:
Small organic molecule
Emp. Form.:
C22H22Cl2FN5O2
Mol. Mass.:
478.347
SMILES:
C[C@H](NC(=O)c1cc(cnc1N)-c1cnn(c1)C1CCOCC1)c1c(Cl)ccc(F)c1Cl
: