Target
Integrin alpha-V/beta-3
Ligand
BDBM50390492
Substrate
Meas. Tech.
ChEMBL_835281 (CHEMBL2071987)
Ki
2.27±n/a nM
Citation
 Ye, YAkers, WXu, BBloch, SOdonkor, CAchilefu, S Near-infrared fluorescent divalent RGD ligand for integrinavß3-targeted optical imaging. Bioorg Med Chem Lett 22:5405-9 (2012)  
Target
Name:
Integrin alpha-V/beta-3
Synonyms:
ITGAV/ITGB3 | Integrin beta-3/Vitronectin receptor alpha
Type:
Enzyme
Mol. Mass.:
Description:
Components:
This complex has 2 components.
Component 1
Name:
Integrin alpha-V
Synonyms:
ITAV_HUMAN Integrin alpha-V/alpha-5 VNRA Vitronectin receptor | Vitronectin receptor subunit alpha
Type:
PROTEIN
Mol. Mass.:
116024.92
Organism:
Homo sapiens (Human)
Description:
ChEMBL_582336
Residue:
1048
  
Component 2
Name:
Integrin beta-3
Synonyms:
CD_antigen=CD61 GPIIIa ITGB3 Platelet membrane glycoprotein IIIa
Type:
Protein
Mol. Mass.:
87038.91
Organism:
Homo sapiens (Human)
Description:
P05106
Residue:
788
  
Inhibitor
Name:
BDBM50390492
Synonyms:
CHEMBL2071605
Type:
Small organic molecule
Emp. Form.:
C27H41N9O8
Mol. Mass.:
619.6699
SMILES:
[#7]-[#6]-[#6]-[#6]-[#6]-[#6@@H]-1-[#7]-[#6](=O)-[#6@@H](-[#6]-c2ccc(-[#8])cc2)-[#7]-[#6](=O)-[#6@H](-[#6]-[#6](-[#8])=O)-[#7]-[#6](=O)-[#6]-[#7]-[#6](=O)-[#6@H](-[#6]-[#6]-[#6]\[#7]=[#6](\[#7])-[#7])-[#7]-[#6]-1=O
: