Target
cAMP-specific 3',5'-cyclic phosphodiesterase 4B
Ligand
BDBM50390613
Substrate
Meas. Tech.
ChEMBL_835445 (CHEMBL2072151)
IC50
110±n/a nM
Citation
 Ochiai, KTakita, SKojima, AEiraku, TAndo, NIwase, KKishi, TOhinata, AYageta, YYasue, TAdams, DRKohno, Y Phosphodiesterase inhibitors. Part 4: design, synthesis and structure-activity relationships of dual PDE3/4-inhibitory fused bicyclic heteroaromatic-4,4-dimethylpyrazolones. Bioorg Med Chem Lett 22:5833-8 (2012)  
Target
Name:
cAMP-specific 3',5'-cyclic phosphodiesterase 4B
Synonyms:
3',5'-cyclic phosphodiesterase Isoform PDE4B1 PDE4B PDE4B_HUMAN Phosphodiesterase 4B (PDE4B) Phosphodiesterase Type 4 (PDE4B)
Type:
Protein
Mol. Mass.:
83318.87
Organism:
Homo sapiens (Human)
Description:
Q07343
Residue:
736
  
Inhibitor
Name:
BDBM50390613
Synonyms:
CHEMBL2069604
Type:
Small organic molecule
Emp. Form.:
C14H13F3N4O2
Mol. Mass.:
326.2738
SMILES:
COc1ccc(C2=NNC(=O)C2(C)C)c2cc(nn12)C(F)(F)F
: