Target
Cyclin-dependent kinase 5 activator 1
Ligand
BDBM50390653
Substrate
Meas. Tech.
ChEMBL_835519 (CHEMBL2072225)
IC50
672±n/a nM
Citation
 Malmström, JViklund, JSlivo, CCosta, AMaudet, MSandelin, CHiller, GOlsson, LLAagaard, AGeschwindner, SXue, YVasänge, M Synthesis and structure-activity relationship of 4-(1,3-benzothiazol-2-yl)-thiophene-2-sulfonamides as cyclin-dependent kinase 5 (cdk5)/p25 inhibitors. Bioorg Med Chem Lett 22:5919-23 (2012)  
Target
Name:
Cyclin-dependent kinase 5 activator 1
Synonyms:
CDK5/p35 Cyclin-dependent kinase 5 regulatory subunit 1 | Cyclin-dependent kinase 5/CDK5 activator 1
Type:
Protein Complex
Mol. Mass.:
Description:
Components:
This complex has 2 components.
Component 1
Name:
Cyclin-dependent kinase 5
Synonyms:
CDK5 CDKN5 Cyclin-dependent kinase 5 (CDK5/ p25) Cyclin-dependent-like kinase 5 PSSALRE Tau protein kinase II catalytic subunit
Type:
Enzyme Subunit
Mol. Mass.:
33308.61
Organism:
Homo sapiens (Human)
Description:
Residue:
292
  
Component 2
Name:
Cyclin-dependent kinase 5 activator 1
Synonyms:
CD5R1_HUMAN CDK5R1 Cyclin-dependent kinase 5 (CDK5/p25) NCK5A p35
Type:
Enzyme Subunit
Mol. Mass.:
34077.43
Organism:
Homo sapiens (Human)
Description:
Q15078
Residue:
307
  
Inhibitor
Name:
BDBM50390653
Synonyms:
CHEMBL2069727
Type:
Small organic molecule
Emp. Form.:
C11H6ClFN2O2S3
Mol. Mass.:
348.824
SMILES:
NS(=O)(=O)c1cc(cs1)-c1nc2ccc(F)c(Cl)c2s1
: