Target
Aldo-keto reductase family 1 member C2
Ligand
BDBM50390661
Substrate
Meas. Tech.
ChEMBL_835620 (CHEMBL2071731)
IC50
15600±n/a nM
Citation
 Sinreih, MSosic, IBeranic, NTurk, SAdeniji, AOPenning, TMRižner, TLGobec, S N-Benzoyl anthranilic acid derivatives as selective inhibitors of aldo-keto reductase AKR1C3. Bioorg Med Chem Lett 22:5948-51 (2012)  
Target
Name:
Aldo-keto reductase family 1 member C2
Synonyms:
3-alpha-HSD3 AK1C2_HUMAN Aldo-keto reductase family 1 member C2 (AK1C2) Aldo-keto reductase family 1 member C2 (AKR1C2) DD-2 DDH2 Dihydrodiol dehydrogenase/bile acid-binding protein Type III 3-alpha-hydroxysteroid dehydrogenase
Type:
Enzyme
Mol. Mass.:
36739.89
Organism:
Homo sapiens (Human)
Description:
Residue:
323
  
Inhibitor
Name:
BDBM50390661
Synonyms:
CHEMBL2070000
Type:
Small organic molecule
Emp. Form.:
C14H8BrFN2O5
Mol. Mass.:
383.126
SMILES:
OC(=O)c1cc(Br)ccc1NC(=O)c1ccc(F)c(c1)[N+]([O-])=O
: