Target
Carbonic anhydrase 9
Ligand
BDBM50337278
Substrate
Meas. Tech.
ChEMBL_835656 (CHEMBL2071767)
Ki
50±n/a nM
Citation
 Sechi, MInnocenti, APala, NRogolino, DCarcelli, MScozzafava, ASupuran, CT Inhibition ofa-class cytosolic human carbonic anhydrases I, II, IX and XII, andß-class fungal enzymes by carboxylic acids and their derivatives: new isoform-I selective nanomolar inhibitors. Bioorg Med Chem Lett 22:5801-6 (2012)  
Target
Name:
Carbonic anhydrase 9
Synonyms:
CA-IX CAH9_HUMAN Carbonic anhydrase 9 (CA IX) Carbonic anhydrase 9 precursor Carbonic anhydrase IX (CAIX) Carbonic anhydrases; II & IX MN RCC-associated antigen G250
Type:
Enzyme
Mol. Mass.:
49669.03
Organism:
Homo sapiens (Human)
Description:
Catalytic domain of human cloned isozyme was used in the assay
Residue:
459
  
Inhibitor
Name:
BDBM50337278
Synonyms:
2-(phenylamino)benzoic acid CHEMBL23832 US9271961, 2 | phenylanthranilic acid
Type:
Small organic molecule
Emp. Form.:
C13H11NO2
Mol. Mass.:
213.2319
SMILES:
OC(=O)c1ccccc1Nc1ccccc1
: