Target
Potassium voltage-gated channel subfamily KQT member 1
Ligand
BDBM50390872
Substrate
Meas. Tech.
ChEMBL_835825 (CHEMBL2071936)
EC50
880±n/a nM
Citation
 Mattmann, MEYu, HLin, ZXu, KHuang, XLong, SWu, MMcManus, OBEngers, DWLe, UMLi, MLindsley, CWHopkins, CR Identification of (R)-N-(4-(4-methoxyphenyl)thiazol-2-yl)-1-tosylpiperidine-2-carboxamide, ML277, as a novel, potent and selective K(v)7.1 (KCNQ1) potassium channel activator. Bioorg Med Chem Lett 22:5936-41 (2012)  
Target
Name:
Potassium voltage-gated channel subfamily KQT member 1
Synonyms:
KCNA8 KCNQ (Kv7) potassium channel KCNQ1_HUMAN Voltage-gated potassium channel subunit Kv7.1 | Voltage-gated potassium channel subunit Kv7.1/Misshapen-like kinase 1
Type:
PROTEIN
Mol. Mass.:
74739.00
Organism:
Homo sapiens (Human)
Description:
ChEMBL_1454245
Residue:
676
  
Inhibitor
Name:
BDBM50390872
Synonyms:
CHEMBL2070964
Type:
Small organic molecule
Emp. Form.:
C23H22N4O4S2
Mol. Mass.:
482.575
SMILES:
COc1ccc(cc1)-c1csc(NC(=O)[C@H]2CCCCN2S(=O)(=O)c2cccc(c2)C#N)n1
: