Target
ATP-binding cassette sub-family C member 2
Ligand
BDBM50390983
Substrate
Meas. Tech.
ChEMBL_839289 (CHEMBL2077960)
Ki
54100±n/a nM
Citation
 Akhteruzzaman, SKato, YHisaka, ASugiyama, Y Primary active transport of peptidic endothelin antagonists by rat hepatic canalicular membrane. J Pharmacol Exp Ther 288:575-81 (1999) Target
Name:
ATP-binding cassette sub-family C member 2
Synonyms:
ATP-binding cassette sub-family C member 2 Canalicular multidrug resistance protein Cmoat MRP2_RAT Multidrug resistance-associated protein 2
Type:
PROTEIN
Mol. Mass.:
173415.22
Organism:
Rattus norvegicus
Description:
ChEMBL_1455464
Residue:
1541
  
Inhibitor
Name:
BDBM50390983
Synonyms:
CHEMBL2074699
Type:
Small organic molecule
Emp. Form.:
C33H44N6O9
Mol. Mass.:
668.7373
SMILES:
COC(=O)n1cc(C[C@H]2NC(=O)[C@H](CC(C)C)NC(=O)[C@H](NC(=O)[C@@H]3CCCN3C(=O)[C@H](CC(O)=O)NC2=O)C(C)C)c2ccccc12
: