Target
Solute carrier organic anion transporter family member 2A1
Ligand
BDBM10042
Substrate
Meas. Tech.
ChEMBL_836140 (CHEMBL2077576)
Ki
38.2±n/a nM
Citation
 Itoh, SLu, RBao, YMorrow, JDRoberts, LJSchuster, VL Structural determinants of substrates for the prostaglandin transporter PGT. Mol Pharmacol 50:738-42 (1996) Target
Name:
Solute carrier organic anion transporter family member 2A1
Synonyms:
Matr1 Prostaglandin transporter (PGT) Slc21a2 Solute carrier family 21 member 2
Type:
Protein
Mol. Mass.:
70404.97
Organism:
Rattus norvegicus (Rat)
Description:
Q00910
Residue:
644
  
Inhibitor
Name:
BDBM10042
Synonyms:
(5Z)-7-[(1R,4S,5R,6R)-6-[(1E,3S)-3-hydroxyoct-1-en-1-yl]-2,3-dioxabicyclo[2.2.1]heptan-5-yl]hept-5-enoic acid 9,11-epoxymethano PGH2 Prostaglandin H2
Type:
Small organic molecule
Emp. Form.:
C20H32O5
Mol. Mass.:
352.4651
SMILES:
CCCCC[C@H](O)\C=C\[C@H]1[C@H]2C[C@H](OO2)[C@@H]1C\C=C/CCCC(O)=O
: