Target
Solute carrier family 22 member 6
Ligand
BDBM50350473
Substrate
Meas. Tech.
ChEMBL_835925 (CHEMBL2077063)
Ki
2330000±n/a nM
Citation
 Jariyawat, SSekine, TTakeda, MApiwattanakul, NKanai, YSophasan, SEndou, H The interaction and transport of beta-lactam antibiotics with the cloned rat renal organic anion transporter 1. J Pharmacol Exp Ther 290:672-7 (1999) Target
Name:
Solute carrier family 22 member 6
Synonyms:
Oat1 S22A6_RAT rOAT1 renal organic anion transporter 1
Type:
PROTEIN
Mol. Mass.:
60784.17
Organism:
Rattus norvegicus
Description:
ChEMBL_838479
Residue:
551
  
Inhibitor
Name:
BDBM50350473
Synonyms:
Aliporina | CEFALORIDINE
Type:
Small organic molecule
Emp. Form.:
C19H17N3O4S2
Mol. Mass.:
415.486
SMILES:
[O-]C(=O)C1=C(C[n+]2ccccc2)CS[C@@H]2[C@@H](NC(=O)Cc3cccs3)C(=O)N12
: