Target
ABC-type glutathione-S-conjugate transporter
Ligand
BDBM50391002
Substrate
Meas. Tech.
ChEMBL_836116 (CHEMBL2077552)
Ki
5600±n/a nM
Citation
 Akita, HSuzuki, HHirohashi, TTakikawa, HSugiyama, Y Transport activity of human MRP3 expressed in Sf9 cells: comparative studies with rat MRP3. Pharm Res 19:34-41 (2002)  
Target
Name:
ABC-type glutathione-S-conjugate transporter
Synonyms:
MRP3 | Multidrug resistance associated protein
Type:
PROTEIN
Mol. Mass.:
167836.19
Organism:
Homo sapiens (Human)
Description:
ChEMBL_837732
Residue:
1514
  
Inhibitor
Name:
BDBM50391002
Synonyms:
CHEMBL2074599
Type:
Small organic molecule
Emp. Form.:
C22H25N3O7S
Mol. Mass.:
475.515
SMILES:
CNc1nc2c(Cc3cccnc3)c(C)c(O[C@@H]3O[C@@H]([C@@H](O)[C@H](O)[C@H]3O)C(O)=O)c(C)c2s1
: