Target
ATP-binding cassette sub-family C member 2
Ligand
BDBM50391007
Substrate
Meas. Tech.
ChEMBL_836450 (CHEMBL2076890)
Ki
121000±n/a nM
Citation
 Kusuhara, HHan, YHShimoda, MKokue, ESuzuki, HSugiyama, Y Reduced folate derivatives are endogenous substrates for cMOAT in rats. Am J Physiol 275:789-96 (1998)  
Target
Name:
ATP-binding cassette sub-family C member 2
Synonyms:
ATP-binding cassette sub-family C member 2 Canalicular multidrug resistance protein Cmoat MRP2_RAT Multidrug resistance-associated protein 2
Type:
PROTEIN
Mol. Mass.:
173415.22
Organism:
Rattus norvegicus
Description:
ChEMBL_1455464
Residue:
1541
  
Inhibitor
Name:
BDBM50391007
Synonyms:
LEVOMEFOLIC ACID | LMSR
Type:
Small organic molecule
Emp. Form.:
C20H25N7O6
Mol. Mass.:
459.4558
SMILES:
CN1[C@@H](CNc2ccc(cc2)C(=O)N[C@@H](CCC(O)=O)C(O)=O)CNc2nc(N)[nH]c(=O)c12
: