Target
Kallikrein-7
Ligand
BDBM50391077
Substrate
Meas. Tech.
ChEMBL_840620 (CHEMBL2090271)
IC50
195800±n/a nM
Citation
 Freitas, RFTeixeira, TSBarros, TGSantos, JAKondo, MYJuliano, MAJuliano, LBlaber, MAntunes, OAAbrahão, OPinheiro, SMuri, EMPuzer, L Isomannide derivatives as new class of inhibitors for human kallikrein 7. Bioorg Med Chem Lett 22:6072-5 (2012)  
Target
Name:
Kallikrein-7
Synonyms:
KLK7 Kallikrein 7 PRSS6 Serine protease 6 hK7 kallikrein-7 isoform 1 preproprotein
Type:
PROTEIN
Mol. Mass.:
27535.05
Organism:
Homo sapiens (Human)
Description:
ChEMBL_1469257
Residue:
253
  
Inhibitor
Name:
BDBM50391077
Synonyms:
CHEMBL2087345
Type:
Small organic molecule
Emp. Form.:
C28H27N3O5
Mol. Mass.:
485.5311
SMILES:
O=C(N[C@@H]1CO[C@@H]2[C@@H](CO[C@H]12)OCc1ccccc1)C(\NC(=O)c1ccccc1)=C\c1cccnc1
: