Target
Cyclin-H/Cyclin-dependent kinase 7
Ligand
BDBM50391210
Substrate
Meas. Tech.
ChEMBL_839473 (CHEMBL2090193)
Ki
>5000±n/a nM
Citation
 Lukasik, PMElabar, SLam, FShao, HLiu, XAbbas, AYWang, S Synthesis and biological evaluation of imidazo[4,5-b]pyridine and 4-heteroaryl-pyrimidine derivatives as anti-cancer agents. Eur J Med Chem 57:311-22 (2012)  
Target
Name:
Cyclin-H/Cyclin-dependent kinase 7
Synonyms:
CDK-activating kinase assembly factor MAT1/Cyclin H/Cyclin-dependent kinase 7 CDK7/H Cyclin-Dependent Kinase 7 (CDK7) Cyclin-dependent kinase 7/cyclin H
Type:
Protein Complex
Mol. Mass.:
Description:
Components:
This complex has 2 components.
Component 1
Name:
Cyclin-H
Synonyms:
CCNH Cyclin H p34 | p37
Type:
Enzyme Subunit
Mol. Mass.:
37646.05
Organism:
Homo sapiens (Human)
Description:
Residue:
323
  
Component 2
Name:
Cyclin-dependent kinase 7
Synonyms:
39 kDa protein kinase CAK1 CDK-activating kinase 1 (CAK) CDK7_HUMAN Cell division protein kinase 7 Cyclin-dependent kinase 7 (CDK7/cyclin H) P39 Mo15 TFIIH basal transcription factor complex kinase subunit
Type:
Enzyme Subunit
Mol. Mass.:
39047.01
Organism:
Homo sapiens (Human)
Description:
Residue:
346
  
Inhibitor
Name:
BDBM50391210
Synonyms:
CHEMBL2088840
Type:
Small organic molecule
Emp. Form.:
C17H14N6O2S
Mol. Mass.:
366.397
SMILES:
NS(=O)(=O)c1cccc(Nc2nccc(n2)-n2ncc3ccccc23)c1
: