Target
Indoleamine 2,3-dioxygenase 1
Ligand
BDBM17452
Substrate
Meas. Tech.
ChEMBL_847931 (CHEMBL2150231)
IC50
>100000±n/a nM
Citation
 Röhrig, UFMajjigapu, SRGrosdidier, ABron, SStroobant, VPilotte, LColau, DVogel, PVan den Eynde, BJZoete, VMichielin, O Rational design of 4-aryl-1,2,3-triazoles for indoleamine 2,3-dioxygenase 1 inhibition. J Med Chem 55:5270-90 (2012)  
Target
Name:
Indoleamine 2,3-dioxygenase 1
Synonyms:
I23O1_HUMAN IDO-1 INDO Indoleamine 2,3-dioxygenase | Indoleamine-pyrrole 2,3-dioxygenase
Type:
Enzyme
Mol. Mass.:
45330.80
Organism:
Homo sapiens (Human)
Description:
P14902
Residue:
403
  
Inhibitor
Name:
BDBM17452
Synonyms:
1,2,3-triazole analogue, 8 | 5-(2-methylphenyl)-1H-1,2,3-triazole
Type:
Small organic molecule
Emp. Form.:
C9H9N3
Mol. Mass.:
159.1879
SMILES:
Cc1ccccc1-c1c[nH]nn1
: