Target
Replicase polyprotein 1a
Ligand
BDBM53072
Substrate
Meas. Tech.
ChEMBL_848934 (CHEMBL2149728)
Ki
9000±n/a nM
Citation
 Park, JYKim, JHKim, YMJeong, HJKim, DWPark, KHKwon, HJPark, SJLee, WSRyu, YB Tanshinones as selective and slow-binding inhibitors for SARS-CoV cysteine proteases. Bioorg Med Chem 20:5928-35 (2012)  
Target
Name:
Replicase polyprotein 1a
Synonyms:
3C-like proteinase 3CLp Growth factor-like peptide Non-structural protein 1 Non-structural protein 11 Non-structural protein 3 Non-structural protein 6 Non-structural protein 8 ORF1a polyprotein PL2-PRO Papain-like proteinase Replicase polyprotein 1a SARS coronavirus 3C-like proteinase nsp1 nsp11 nsp3 nsp5 nsp7 nsp9 pp1a
Type:
Enzyme
Mol. Mass.:
486353.36
Organism:
Human SARS coronavirus (SARS-CoV)
Description:
P0C6U8
Residue:
4382
  
Inhibitor
Name:
BDBM53072
Synonyms:
(5Z)-3-allyl-5-(3-ethyl-1,3-benzothiazol-2-ylidene)-2-thioxo-thiazolidin-4-one (5Z)-5-(3-ethyl-1,3-benzothiazol-2-ylidene)-3-prop-2-enyl-2-sulfanylidene-4-thiazolidinone MLS001210616 cid_3094418
Type:
Small organic molecule
Emp. Form.:
C15H14N2OS3
Mol. Mass.:
334.479
SMILES:
CCN1\C(Sc2ccccc12)=C1\SC(=S)N(CC=C)C1=O
: