Target
Papain
Ligand
BDBM50009219
Substrate
Meas. Tech.
ChEMBL_848940 (CHEMBL2149734)
IC50
88000±n/a nM
Citation
 Park, JYKim, JHKim, YMJeong, HJKim, DWPark, KHKwon, HJPark, SJLee, WSRyu, YB Tanshinones as selective and slow-binding inhibitors for SARS-CoV cysteine proteases. Bioorg Med Chem 20:5928-35 (2012)  
Target
Name:
Papain
Synonyms:
Allergen=Car p 1 PPI | Papaya proteinase I
Type:
Enzyme
Mol. Mass.:
38923.01
Organism:
Carica papaya
Description:
Papain was purchased from Sigma, Germany.
Residue:
345
  
Inhibitor
Name:
BDBM50009219
Synonyms:
2-isopropyl-8,8-dimethyl-5,6,7,8-tetrahydrophenanthrene-3,4-dione MILTIRONE miltirone;2-Isopropyl-8,8-dimethyl-5,6,7,8-tetrahydro-phenanthrene-3,4-dione
Type:
Small organic molecule
Emp. Form.:
C19H22O2
Mol. Mass.:
282.3768
SMILES:
CC(C)C1=Cc2ccc3c(CCCC3(C)C)c2C(=O)C1=O
: