Target
Melanin-concentrating hormone receptor 1
Ligand
BDBM50391432
Substrate
Meas. Tech.
ChEMBL_849235 (CHEMBL2148716)
Kd
0.18±n/a nM
Citation
 Philippe, CUngersboeck, JSchirmer, EZdravkovic, MNics, LZeilinger, MShanab, KLanzenberger, RKaranikas, GSpreitzer, HViernstein, HMitterhauser, MWadsak, W [¹8F]FE@SNAP-A new PET tracer for the melanin concentrating hormone receptor 1 (MCHR1): microfluidic and vessel-based approaches. Bioorg Med Chem 20:5936-40 (2012)  
Target
Name:
Melanin-concentrating hormone receptor 1
Synonyms:
G-protein coupled receptor 24 MCH receptor 1 MCH-R1 MCHR-1 MCHR1_HUMAN Melanin-Concentrating Hormone Receptor 1 (MCH1R) Melanin-concentrating hormone receptor 1 (MCH-1) Melanin-concentrating hormone receptor 1 (MCHR-1) SLC-1 Somatostatin receptor-like protein
Type:
G Protein-Coupled Receptor (GPCR)
Mol. Mass.:
45976.27
Organism:
Homo sapiens (Human)
Description:
Membranes from CHO-K1 cells stably expressing human MCH1R were used in assays.
Residue:
422
  
Inhibitor
Name:
BDBM50391432
Synonyms:
CHEMBL2146615
Type:
Small organic molecule
Emp. Form.:
C31H37F2N5O6
Mol. Mass.:
613.6522
SMILES:
COCC1=C([C@@H](N(C(=O)NCCCN2CCC(CC2)c2cccc(NC(C)=O)c2)C(=O)N1)c1ccc(F)c(F)c1)C(=O)OC
: