Target
Dipeptidyl peptidase 4
Ligand
BDBM50391475
Substrate
Meas. Tech.
ChEMBL_849433 (CHEMBL2149434)
IC50
21±n/a nM
Citation
 Ikuma, YHochigai, HKimura, HNunami, NKobayashi, TUchiyama, KFuruta, YSakai, MHoriguchi, MMasui, YOkazaki, KSato, YNakahira, H Discovery of 3H-imidazo[4,5-c]quinolin-4(5H)-ones as potent and selective dipeptidyl peptidase IV (DPP-4) inhibitors. Bioorg Med Chem 20:5864-83 (2012)  
Target
Name:
Dipeptidyl peptidase 4
Synonyms:
ADABP Adenosine deaminase complexing protein 2 CD_antigen=CD26 DPP4 DPPIV Dipeptidyl peptidase 4 (DPP IV) Dipeptidyl peptidase 4 (DPP4) Dipeptidyl peptidase 4 membrane form Dipeptidyl peptidase IV Dipeptidyl peptidase IV (DDP-IV) Dipeptidyl peptidase IV membrane form Dipeptidyl peptidase-IV (DPP-4) T-cell activation antigen CD26 | TP103
Type:
Enzyme
Mol. Mass.:
88271.01
Organism:
Homo sapiens (Human)
Description:
P27487
Residue:
766
  
Inhibitor
Name:
BDBM50391475
Synonyms:
CHEMBL2147079
Type:
Small organic molecule
Emp. Form.:
C25H26ClN5O3
Mol. Mass.:
479.959
SMILES:
COC(=O)c1ccc2n(C)c(=O)c3n(Cc4ccccc4Cl)c(nc3c2c1)N1CCC[C@@H](N)C1
: