Target
4-aminobutyrate aminotransferase, mitochondrial
Ligand
BDBM50391516
Substrate
Meas. Tech.
ChEMBL_849664 (CHEMBL2150218)
Ki
2140000±n/a nM
Citation
 Hawker, DDSilverman, RB Synthesis and evaluation of novel heteroaromatic substrates of GABA aminotransferase. Bioorg Med Chem 20:5763-73 (2012)  
Target
Name:
4-aminobutyrate aminotransferase, mitochondrial
Synonyms:
(S)-3-amino-2-methylpropionate transaminase 2.6.1.22 ABAT GABA transaminase GABA-T GABT_PIG L-AIBAT
Type:
Mol. Mass.:
56633.06
Organism:
Sus scrofa
Description:
Residue:
500
  
Inhibitor
Name:
BDBM50391516
Synonyms:
CHEMBL2147349
Type:
Small organic molecule
Emp. Form.:
C6H8N2O2
Mol. Mass.:
140.1399
SMILES:
NCc1ccc([nH]1)C(O)=O
: