Target
Cathepsin B
Ligand
BDBM50391541
Substrate
Meas. Tech.
ChEMBL_849825 (CHEMBL2148452)
EC50
700±n/a nM
Citation
 Anas, ARKisugi, TUmezawa, TMatsuda, FCampitelli, MRQuinn, RJOkino, T Thrombin inhibitors from the freshwater cyanobacterium Anabaena compacta. J Nat Prod 75:1546-52 (2012)  
Target
Name:
Cathepsin B
Synonyms:
APP secretase CATB_HUMAN CTSB Cathepsin B light chain | Cathepsin B1
Type:
Enzyme
Mol. Mass.:
37819.69
Organism:
Homo sapiens (Human)
Description:
gi_63102437
Residue:
339
  
Inhibitor
Name:
BDBM50391541
Synonyms:
CHEMBL2147467
Type:
Small organic molecule
Emp. Form.:
C32H44N4O8
Mol. Mass.:
612.7138
SMILES:
C[C@H]1C[C@H](N(C1)C(=O)[C@@H](CCc1ccc(O)cc1)NC(=O)[C@H](O)Cc1ccc(O)cc1)C(=O)N(C)[C@H](CCCCN)C(O)=O
: