Target
Dual specificity protein phosphatase 4
Ligand
BDBM50391712
Substrate
Meas. Tech.
ChEMBL_848110 (CHEMBL2148511)
IC50
>100000±n/a nM
Citation
 Park, HChien, PNRyu, SE Discovery of potent inhibitors of receptor protein tyrosine phosphatase sigma through the structure-based virtual screening. Bioorg Med Chem Lett 22:6333-7 (2012)  
Target
Name:
Dual specificity protein phosphatase 4
Synonyms:
DUS4_HUMAN Dual specificity protein phosphatase hVH2 MKP-2 Mitogen-activated protein kinase phosphatase 2 | VH2
Type:
PROTEIN
Mol. Mass.:
42957.74
Organism:
Homo sapiens (Human)
Description:
ChEMBL_848110
Residue:
394
  
Inhibitor
Name:
BDBM50391712
Synonyms:
CHEMBL2146959
Type:
Small organic molecule
Emp. Form.:
C19H13N5O5S
Mol. Mass.:
423.402
SMILES:
[O-][N+](=O)c1ccccc1NC(=O)CSc1nnc(-c2ccco2)c(n1)-c1ccco1
: