Target
Protein-tyrosine-phosphatase
Ligand
BDBM50391715
Substrate
Meas. Tech.
ChEMBL_848109 (CHEMBL2148510)
IC50
700±n/a nM
Citation
 Park, HChien, PNRyu, SE Discovery of potent inhibitors of receptor protein tyrosine phosphatase sigma through the structure-based virtual screening. Bioorg Med Chem Lett 22:6333-7 (2012)  
Target
Name:
Protein-tyrosine-phosphatase
Synonyms:
PTPsigma | PTPsigma-(Brain)
Type:
PROTEIN
Mol. Mass.:
168790.22
Organism:
Homo sapiens (Human)
Description:
ChEMBL_848109
Residue:
1502
  
Inhibitor
Name:
BDBM50391715
Synonyms:
CHEMBL2146960
Type:
Small organic molecule
Emp. Form.:
C14H11N3O4
Mol. Mass.:
285.2548
SMILES:
Oc1ccc(C=c2c(=O)[nH]c3cc(=C)on3c2=N)cc1O
: